{"text_format":"1","workbook":"xlsx","n_sheets":4,"sheets":["Home","Barrier Data","Projects","Model"],"not_rendered":{"charts":0,"images":2,"macros":1,"external_links":0,"defined_names":108,"comments":2,"pivot_tables":0},"unopened":[],"bounds":{"document_bytes":16777216,"sheet_cells":100000,"rows_first":2000,"rows_last":500,"rows_between":2000,"halvings":0,"cell_chars":16384,"cell_head_chars":4096},"cells_cut":0,"cells_raw":0,"read":"whole","date_system":"1900"}

{"sheet":"Home","index":0,"n_rows":0,"n_cols":0,"rows_kept":0,"cut":false,"hidden":false,"merged":[]}

{"sheet":"Barrier Data","index":1,"n_rows":677,"n_cols":27,"rows_kept":677,"cut":false,"hidden":false,"merged":[]}
[]
[]
[]
[]
[]
["BARID","CATCHMENT","DSID","USHAB","PRE_PASS","PRE_HPOW","PRE_WSTORE","BARID","DSID","HABTOTAL","z","zdwn","zup","hp","ws","match","CHECK","invalid"]
[null,null,null,null,null,null,null,{"$f":"\"Bar_\"&A7","v":"Bar_"},{"$f":"IF(C7=\"NA\",\"NA\",\"Bar_\"&C7)","v":"Bar_"},{"$f":"VLOOKUP(B7,$Z$8:$AA$1048576,2,FALSE)","v":{"$error":"#N/A"}},null,null,null,null,null,{"$f":"MATCH(C7,$A$8:$A$1048576,0)","v":{"$error":"#N/A"}},{"$f":"IF(C7=\"NA\",\"\",IF(ISNUMBER(P7),\"\",\"Error: ID not found\"))","v":"Error: ID not found"},{"$f":"IF(C7=\"NA\",0,IF(ISNUMBER(P7),0,1))","v":1},null,null,null,null,null,null,null,"CATCH","HAB"]
["Dummy","TestCatchment","NA",0.7,1,0,0,{"$f":"\"Bar_\"&A8","v":"Bar_Dummy"},{"$f":"IF(C8=\"NA\",\"NA\",\"Bar_\"&C8)","v":"NA"},{"$f":"VLOOKUP(B8,$Z$8:$AA$1048576,2,FALSE)","v":11.399999999999999},1,0.7,9.4749999999999996,0,0,{"$f":"MATCH(C8,$A$8:$A$1048576,0)","v":{"$error":"#N/A"}},{"$f":"IF(C8=\"NA\",\"\",IF(ISNUMBER(P8),\"\",\"Error: ID not found\"))","v":""},{"$f":"IF(C8=\"NA\",0,IF(ISNUMBER(P8),0,1))","v":0},null,null,null,null,null,null,null,"TestCatchment",11.399999999999999]
["A","TestCatchment","Dummy",2.1,0.4,0,0,"Bar_A","Bar_Dummy",11.399999999999999,1,2.8,8.7750000000000004,0,0,1,"",0]
["B","TestCatchment","A",0.9,0,0,0,"Bar_B","Bar_A",11.399999999999999,1,5.625,3.91,0,0,2,"",0]
["C","TestCatchment","B",4.3,0.3,0,0,"Bar_C","Bar_B",11.399999999999999,1,9.9250000000000007,3.01,0,0,3,"",0]
["D","TestCatchment","A",1.7,0.5,0,0,"Bar_D","Bar_A",11.399999999999999,0.5,5.0549999999999997,1.925,0,0,2,"",0]
["E","TestCatchment","D",1.2,0.2,0,0,"Bar_E","Bar_D",11.399999999999999,0.1,2.3010000000000002,0,0,0,5,"",0]
["F","TestCatchment","D",0.5,0.1,0,0,"Bar_F","Bar_D",11.399999999999999,0.5,5.5549999999999997,0.45,0,0,5,"",0]
[null,null,null,null,null,null,null,null,null,null,0,0.14485000000000001,1.431E-3,0,0]
[null,null,null,null,null,null,null,null,null,null,0,0.165716,0,0,0]
[null,null,null,null,null,null,null,null,null,null,0,1.4600500000000001,0.192244,0,0]
[null,null,null,null,null,null,null,null,null,null,0,25.017399999999999,7.5498099999999999,0,0]
[null,null,null,null,null,null,null,null,null,null,0.18,8.6828400000000006,0.56512399999999996,0,0]
[null,null,null,null,null,null,null,null,null,null,0,11.392300000000001,0,0,0]
[null,null,null,null,null,null,null,null,null,null,0,0.54950600000000005,0.20470099999999999,0,0]
[null,null,null,null,null,null,null,null,null,null,0,0.71565699999999999,0,0,0]
[null,null,null,null,null,null,null,null,null,null,0,9.4574000000000005E-2,0,0,0]
[null,null,null,null,null,null,null,null,null,null,0,1.2796E-2,0,63,0]
[null,null,null,null,null,null,null,null,null,null,0,0.85370100000000004,9.1901800000000006E-2,0,0]
[null,null,null,null,null,null,null,null,null,null,0,0.53448099999999998,0.21365700000000001,0,0]
[null,null,null,null,null,null,null,null,null,null,0,8.7859300000000005,3.2764199999999999,0,0]
[null,null,null,null,null,null,null,null,null,null,0.19500000000000001,12.163,2.5211100000000002,0,0]
[null,null,null,null,null,null,null,null,null,null,1.6199999999999999E-2,0.80608599999999997,6.9040299999999999E-2,0,0]
[null,null,null,null,null,null,null,null,null,null,5.8320000000000004E-3,2.3526400000000001,0.74248099999999995,0,0]
[null,null,null,null,null,null,null,null,null,null,0,1.95208,1.6506E-2,0,0]
[null,null,null,null,null,null,null,null,null,null,0,2.8832E-2,0,1,0]
[null,null,null,null,null,null,null,null,null,null,0,2.6013000000000001E-2,0,0,0]
[null,null,null,null,null,null,null,null,null,null,0,1.4066E-2,0,0,0]
[null,null,null,null,null,null,null,null,null,null,0,7.2403999999999996E-2,0,0,0]
[null,null,null,null,null,null,null,null,null,null,0,2.5246999999999999E-2,0,0,0]
[null,null,null,null,null,null,null,null,null,null,0,7.4158000000000002E-2,0,0,0]
[null,null,null,null,null,null,null,null,null,null,0,0.66272299999999995,0,0,0]
[null,null,null,null,null,null,null,null,null,null,0,2.4971E-2,0,0,0]
[null,null,null,null,null,null,null,null,null,null,0,0.23854500000000001,0.108764,0,0]
[null,null,null,null,null,null,null,null,null,null,0,2.5687999999999999E-2,9.2479999999999993E-3,0,0]
[null,null,null,null,null,null,null,null,null,null,0,4.7728100000000002E-2,6.9030000000000003E-3,0,0]
[null,null,null,null,null,null,null,null,null,null,0,8.7138499999999994E-2,1.5665999999999999E-2,0,0]
[null,null,null,null,null,null,null,null,null,null,0,4.94075E-2,8.1919999999999996E-3,0,0]
[null,null,null,null,null,null,null,null,null,null,0,0.29954799999999998,8.7521000000000002E-2,0,0]
[null,null,null,null,null,null,null,null,null,null,0,5.3043E-2,0,0,0]
[null,null,null,null,null,null,null,null,null,null,0,6.3220999999999999E-2,1.7080999999999999E-2,0,0]
[null,null,null,null,null,null,null,null,null,null,0,3.4868999999999997E-2,0,0,0]
[null,null,null,null,null,null,null,null,null,null,0,3.7941000000000003E-2,0,0,0]
[null,null,null,null,null,null,null,null,null,null,0,0.15675900000000001,0,0,0]
[null,null,null,null,null,null,null,null,null,null,0,0.86787099999999995,0,0,0]
[null,null,null,null,null,null,null,null,null,null,0,1.2433099999999999,1.8085799999999999E-2,0,0]
[null,null,null,null,null,null,null,null,null,null,0,9.1769800000000004,0,0,0]
[null,null,null,null,null,null,null,null,null,null,0,0.218943,0,0,0]
[null,null,null,null,null,null,null,null,null,null,0,1.8729,0,0,0]
[null,null,null,null,null,null,null,null,null,null,0,0.16686599999999999,0,0,0]
[null,null,null,null,null,null,null,null,null,null,0,9.5579900000000002,0,0,0]
[null,null,null,null,null,null,null,null,null,null,0,1.2097800000000001,0,0,0]
[null,null,null,null,null,null,null,null,null,null,0,1.46987,0.52399399999999996,0,0]
[null,null,null,null,null,null,null,null,null,null,0,0.99792999999999998,9.5547499999999994E-2,0,0]
[null,null,null,null,null,null,null,null,null,null,0,0.49695699999999998,0.122447,0,0]
[null,null,null,null,null,null,null,null,null,null,0,2.5738099999999999,2.10528,0,0]
[null,null,null,null,null,null,null,null,null,null,0,0.46853299999999998,0,0,0]
[null,null,null,null,null,null,null,null,null,null,0,6.0325999999999998E-2,0,0,0]
[null,null,null,null,null,null,null,null,null,null,0,1.9473800000000001,0,6,0]
[null,null,null,null,null,null,null,null,null,null,0,1.1242E-2,0,0,0]
[null,null,null,null,null,null,null,null,null,null,0,18.944099999999999,0,0,0]
[null,null,null,null,null,null,null,null,null,null,0,3.0353500000000002,0,5,0]
[null,null,null,null,null,null,null,null,null,null,0,2.5868000000000002,0,0,0]
[null,null,null,null,null,null,null,null,null,null,0,0.85697299999999998,0.16325500000000001,0,0]
[null,null,null,null,null,null,null,null,null,null,0,2.9602E-2,0,0,0]
[null,null,null,null,null,null,null,null,null,null,0,7.8799400000000006E-2,0.31990600000000002,0,0]
[null,null,null,null,null,null,null,null,null,null,0,3.8143199999999999,1.56752,0,0]
[null,null,null,null,null,null,null,null,null,null,0,0.28880299999999998,0,0,0]
[null,null,null,null,null,null,null,null,null,null,0,3.1225900000000001E-2,3.2729999999999999E-3,0,0]
[null,null,null,null,null,null,null,null,null,null,0,1.4895499999999999,0,0,0]
[null,null,null,null,null,null,null,null,null,null,0,0.41173599999999999,0,0,0]
[null,null,null,null,null,null,null,null,null,null,0,0.34372000000000003,0,0,0]
[null,null,null,null,null,null,null,null,null,null,0,7.0981000000000002E-2,0,0,0]
[null,null,null,null,null,null,null,null,null,null,0,-1.5892999999999999,0,0,0]
[null,null,null,null,null,null,null,null,null,null,0,-0.86569600000000002,0,0,0]
[null,null,null,null,null,null,null,null,null,null,0,1.1291899999999999,0,0,0]
[null,null,null,null,null,null,null,null,null,null,0,20.380099999999999,0,33,0]
[null,null,null,null,null,null,null,null,null,null,0,4.5188100000000002,0,0,0]
[null,null,null,null,null,null,null,null,null,null,0,1.4563E-2,0,0,0]
[null,null,null,null,null,null,null,null,null,null,0,1.9007E-2,0,0,0]
[null,null,null,null,null,null,null,null,null,null,0,7.6182E-2,0,0,0]
[null,null,null,null,null,null,null,null,null,null,0,0.45932600000000001,4.6250399999999997E-2,0,0]
[null,null,null,null,null,null,null,null,null,null,0,2.5104000000000001E-2,0,0,0]
[null,null,null,null,null,null,null,null,null,null,0,0.51882499999999998,0,0,0]
[null,null,null,null,null,null,null,null,null,null,0,4.3121099999999997,0,0,0]
[null,null,null,null,null,null,null,null,null,null,0,0.50447600000000004,0.121127,0,0]
[null,null,null,null,null,null,null,null,null,null,0,9.8974200000000003,0.269202,0,0]
[null,null,null,null,null,null,null,null,null,null,0,8.5961800000000004,0,0,0]
[null,null,null,null,null,null,null,null,null,null,0,5.2654199999999998E-2,8.6350400000000001E-3,0,0]
[null,null,null,null,null,null,null,null,null,null,0,7.9699999999999997E-3,0,0,0]
[null,null,null,null,null,null,null,null,null,null,0,0.233483,0,0,0]
[null,null,null,null,null,null,null,null,null,null,0,0.19745799999999999,3.7159200000000003E-2,0,0]
[null,null,null,null,null,null,null,null,null,null,0,7.4269100000000005E-2,3.2544200000000002E-2,0,0]
[null,null,null,null,null,null,null,null,null,null,0,0.12135700000000001,2.6647799999999999E-2,0,0]
[null,null,null,null,null,null,null,null,null,null,0,4.5474199999999999E-2,3.3700599999999998E-3,0,0]
[null,null,null,null,null,null,null,null,null,null,0,2.9208499999999998E-2,1.03131E-2,0,0]
[null,null,null,null,null,null,null,null,null,null,0,0.116706,2.9778200000000001E-2,0,0]
[null,null,null,null,null,null,null,null,null,null,0,3.8089600000000001E-2,9.7005700000000004E-3,0,0]
[null,null,null,null,null,null,null,null,null,null,0,0.16830200000000001,3.4413199999999998E-2,0,0]
[null,null,null,null,null,null,null,null,null,null,0,0.11282300000000001,1.5601E-2,0,0]
[null,null,null,null,null,null,null,null,null,null,0,0.20991799999999999,0,0,0]
[null,null,null,null,null,null,null,null,null,null,0,10.1068,0,0,0]
[null,null,null,null,null,null,null,null,null,null,0,0.65504600000000002,0,13,0]
[null,null,null,null,null,null,null,null,null,null,0,0.272233,0.107443,0,0]
[null,null,null,null,null,null,null,null,null,null,0,1.2348300000000001,3.8000399999999997E-2,0,0]
[null,null,null,null,null,null,null,null,null,null,0,2.8828499999999999,0,0,0]
[null,null,null,null,null,null,null,null,null,null,0,0.62324100000000004,1.09023E-2,0,0]
[null,null,null,null,null,null,null,null,null,null,0,0.30474699999999999,5.1991999999999997E-2,0,0]
[null,null,null,null,null,null,null,null,null,null,0,0.195489,2.45604E-2,0,0]
[null,null,null,null,null,null,null,null,null,null,0,5.8426999999999998,2.0977800000000002,0,0]
[null,null,null,null,null,null,null,null,null,null,0,1.4691700000000001,0.28648800000000002,0,0]
[null,null,null,null,null,null,null,null,null,null,0,1.02491,0,0,0]
[null,null,null,null,null,null,null,null,null,null,0,2.2841499999999999,0.20002200000000001,0,0]
[null,null,null,null,null,null,null,null,null,null,0,0.14838599999999999,0,0,0]
{"$rows_left_out":558}
{"sheet":"Projects","index":2,"n_rows":674,"n_cols":16,"rows_kept":674,"cut":false,"hidden":false,"merged":[]}
[]
[]
[]
[]
[]
["BARID","DESCRIPTION","FORCE","COST","POST_PASS","POST_HPOW","POST_WSTORE","BARID","DESCR","x","y","ydwn","yup","match","CHECK","invalid"]
[null,null,null,null,null,null,null,{"$f":"\"Bar_\"&A7","v":"Bar_"},{"$f":"B7","v":0},null,null,null,null,{"$f":"MATCH(A7,'Barrier Data'!$A$8:$A$1048576,0)","v":{"$error":"#N/A"}},{"$f":"IF(ISNUMBER(N7),\"\",\"Error: ID not found\")","v":"Error: ID not found"},{"$f":"IF(I7=\"NA\",0,IF(ISNUMBER(N7),0,1))","v":1}]
["A","Remove",0,250,1,0,0,{"$f":"\"Bar_\"&A8","v":"Bar_A"},{"$f":"B8","v":"Remove"},1,0.6,0.42,4.7610000000000001,{"$f":"MATCH(A8,'Barrier Data'!$A$8:$A$1048576,0)","v":2},{"$f":"IF(ISNUMBER(N8),\"\",\"Error: ID not found\")","v":""},{"$f":"IF(I8=\"NA\",0,IF(ISNUMBER(N8),0,1))","v":0}]
["B","Remove",0,120,1,0,0,"Bar_B","Remove",1,1,4.7249999999999996,3.91,{"$f":"MATCH(A9,'Barrier Data'!$A$8:$A$1048576,0)","v":3},"",0]
["C","Remove",0,70,1,0,0,"Bar_C","Remove",1,0.7,3.9375,3.01,{"$f":"MATCH(A10,'Barrier Data'!$A$8:$A$1048576,0)","v":4},"",0]
["E","Remove",0,100,1,0,0,"Bar_E","Remove",0,0,0,0,{"$f":"MATCH(A11,'Barrier Data'!$A$8:$A$1048576,0)","v":6},"",0]
["F","Remove",0,50,1,0,0,"Bar_F","Remove",1,0.45,4.5495000000000001,0.45,{"$f":"MATCH(A12,'Barrier Data'!$A$8:$A$1048576,0)","v":7},"",0]
[null,null,null,null,null,null,null,null,null,0,0,0,0]
[null,null,null,null,null,null,null,null,null,0,0,0,0]
[null,null,null,null,null,null,null,null,null,0,0,0,0]
[null,null,null,null,null,null,null,null,null,0,0,0,0]
[null,null,null,null,null,null,null,null,null,0,0,0,0]
[null,null,null,null,null,null,null,null,null,0,0,0,0]
[null,null,null,null,null,null,null,null,null,0,0,0,0]
[null,null,null,null,null,null,null,null,null,0,1,0,0]
[null,null,null,null,null,null,null,null,null,0,0,0,0]
[null,null,null,null,null,null,null,null,null,0,0,0,0]
[null,null,null,null,null,null,null,null,null,0,0,0,0]
[null,null,null,null,null,null,null,null,null,0,0,0,0]
[null,null,null,null,null,null,null,null,null,0,0,0,0]
[null,null,null,null,null,null,null,null,null,0,0,0,0]
[null,null,null,null,null,null,null,null,null,0,0,0,0]
[null,null,null,null,null,null,null,null,null,0,0.80500000000000005,0,0]
[null,null,null,null,null,null,null,null,null,0,0,0,0]
[null,null,null,null,null,null,null,null,null,0,0,0,0]
[null,null,null,null,null,null,null,null,null,0,0,0,0]
[null,null,null,null,null,null,null,null,null,0,0,0,0]
[null,null,null,null,null,null,null,null,null,0,0,0,0]
[null,null,null,null,null,null,null,null,null,0,0,0,0]
[null,null,null,null,null,null,null,null,null,0,0,0,0]
[null,null,null,null,null,null,null,null,null,0,0,0,0]
[null,null,null,null,null,null,null,null,null,0,0,0,0]
[null,null,null,null,null,null,null,null,null,0,0,0,0]
[null,null,null,null,null,null,null,null,null,0,0,0,0]
[null,null,null,null,null,null,null,null,null,0,0,0,0]
[null,null,null,null,null,null,null,null,null,0,0,0,0]
[null,null,null,null,null,null,null,null,null,0,0,0,0]
[null,null,null,null,null,null,null,null,null,0,0,0,0]
[null,null,null,null,null,null,null,null,null,0,0,0,0]
[null,null,null,null,null,null,null,null,null,0,0,0,0]
[null,null,null,null,null,null,null,null,null,0,0,0,0]
[null,null,null,null,null,null,null,null,null,0,0,0,0]
[null,null,null,null,null,null,null,null,null,0,0,0,0]
[null,null,null,null,null,null,null,null,null,0,0,0,0]
[null,null,null,null,null,null,null,null,null,0,0,0,0]
[null,null,null,null,null,null,null,null,null,0,0,0,0]
[null,null,null,null,null,null,null,null,null,0,0,0,0]
[null,null,null,null,null,null,null,null,null,0,0,0,0]
[null,null,null,null,null,null,null,null,null,0,0,0,0]
[null,null,null,null,null,null,null,null,null,0,0,0,0]
[null,null,null,null,null,null,null,null,null,0,0,0,0]
[null,null,null,null,null,null,null,null,null,0,0,0,0]
[null,null,null,null,null,null,null,null,null,0,0,0,0]
[null,null,null,null,null,null,null,null,null,0,0,0,0]
[null,null,null,null,null,null,null,null,null,0,0,0,0]
[null,null,null,null,null,null,null,null,null,0,0,0,0]
[null,null,null,null,null,null,null,null,null,0,0,0,0]
[null,null,null,null,null,null,null,null,null,0,0,0,0]
[null,null,null,null,null,null,null,null,null,0,0,0,0]
[null,null,null,null,null,null,null,null,null,0,0,0,0]
[null,null,null,null,null,null,null,null,null,0,0,0,0]
[null,null,null,null,null,null,null,null,null,0,0,0,0]
[null,null,null,null,null,null,null,null,null,0,0,0,0]
[null,null,null,null,null,null,null,null,null,0,0,0,0]
[null,null,null,null,null,null,null,null,null,0,0,0,0]
[null,null,null,null,null,null,null,null,null,0,0,0,0]
[null,null,null,null,null,null,null,null,null,0,0,0,0]
[null,null,null,null,null,null,null,null,null,0,0,0,0]
[null,null,null,null,null,null,null,null,null,0,0,0,0]
[null,null,null,null,null,null,null,null,null,0,0,0,0]
[null,null,null,null,null,null,null,null,null,0,0,0,0]
[null,null,null,null,null,null,null,null,null,0,0,0,0]
[null,null,null,null,null,null,null,null,null,0,0,0,0]
[null,null,null,null,null,null,null,null,null,0,0,-2.2397,0]
[null,null,null,null,null,null,null,null,null,0,0,-1.5892999999999999,0]
[null,null,null,null,null,null,null,null,null,0,0,0,0]
[null,null,null,null,null,null,null,null,null,0,0,0,0]
[null,null,null,null,null,null,null,null,null,0,0,0,0]
[null,null,null,null,null,null,null,null,null,0,0,0,0]
[null,null,null,null,null,null,null,null,null,0,0,0,0]
[null,null,null,null,null,null,null,null,null,0,0,0,0]
[null,null,null,null,null,null,null,null,null,0,0,0,0]
[null,null,null,null,null,null,null,null,null,0,0,0,0]
[null,null,null,null,null,null,null,null,null,0,0,0,0]
[null,null,null,null,null,null,null,null,null,0,0,0,0]
[null,null,null,null,null,null,null,null,null,0,0,0,0]
[null,null,null,null,null,null,null,null,null,0,0,0,0]
[null,null,null,null,null,null,null,null,null,0,0,0,0]
[null,null,null,null,null,null,null,null,null,0,0,0,0]
[null,null,null,null,null,null,null,null,null,0,0,0,0]
[null,null,null,null,null,null,null,null,null,0,0,0,0]
[null,null,null,null,null,null,null,null,null,0,0,0,0]
[null,null,null,null,null,null,null,null,null,0,0,0,0]
[null,null,null,null,null,null,null,null,null,0,0,0,0]
[null,null,null,null,null,null,null,null,null,0,0,0,0]
[null,null,null,null,null,null,null,null,null,0,0,0,0]
[null,null,null,null,null,null,null,null,null,0,0,0,0]
[null,null,null,null,null,null,null,null,null,0,0,0,0]
[null,null,null,null,null,null,null,null,null,0,0,0,0]
[null,null,null,null,null,null,null,null,null,0,0,0,0]
[null,null,null,null,null,null,null,null,null,0,0,0,0]
[null,null,null,null,null,null,null,null,null,0,0,0,0]
[null,null,null,null,null,null,null,null,null,0,0,0,0]
[null,null,null,null,null,null,null,null,null,0,0,0,0]
[null,null,null,null,null,null,null,null,null,0,0,0,0]
[null,null,null,null,null,null,null,null,null,0,0,0,0]
[null,null,null,null,null,null,null,null,null,0,0,0,0]
[null,null,null,null,null,null,null,null,null,0,0,0,0]
[null,null,null,null,null,null,null,null,null,0,0,0,0]
[null,null,null,null,null,null,null,null,null,0,0,0,0]
[null,null,null,null,null,null,null,null,null,0,0,0,0]
[null,null,null,null,null,null,null,null,null,0,0,0,0]
[null,null,null,null,null,null,null,null,null,0,0,0,0]
[null,null,null,null,null,null,null,null,null,0,0,0,0]
[null,null,null,null,null,null,null,null,null,0,0,-6.5060200000000004,0]
{"$rows_left_out":555}
{"sheet":"Model","index":3,"n_rows":29,"n_cols":9,"rows_kept":29,"cut":false,"hidden":false,"merged":[]}
[]
[]
[]
[]
[]
[null,"Inputs"]
[null,"Min budget",{"$f":"SUMPRODUCT(Projects!C8:C1048576,(Projects!D8:D1048576>0))","v":0}]
[null,"Budget",500]
[]
[null,"Connectivity wts","Raw","Normalized"]
[null,"Diadromous",1,{"$f":"C11/$C$13","v":1}]
[null,"Potadromous",0,{"$f":"C12/$C$13","v":0}]
[null,"Total",{"$f":"SUM(C11:C12)","v":1},{"$f":"SUM(D11:D12)","v":1}]
[]
[null,"Constraints","Current","Target","Include?"]
[null,"Hydropower (kW)",{"$f":"SUM('Barrier Data'!F9:F1048576)","v":0},0,null,null,null,false,{"$f":"IF(H16,D16,0)","v":0}]
[null,"Water storage (ML)",{"$f":"SUM('Barrier Data'!G8:G1048576)","v":0},0,null,null,null,false,{"$f":"IF(H17,D17,0)","v":0}]
[]
[null,"KPIs"]
[null,"Total wt habitat:",9.2200000000000006,null,null,null,null,"Errors"]
[null,"Total hydropower (kW)",{"$f":"SUM(hp)","v":0},null,null,null,null,"Barriers",{"$f":"SUM('Barrier Data'!R8:R1048576)","v":0}]
[null,"Total water storage (ML)",{"$f":"SUM(ws)","v":0},null,null,null,null,"Projects",{"$f":"SUM(Projects!P8:P1048576)","v":0}]
[]
[null,"Solution"]
[null,"BARID","DESCRIPTION","HPOWER","WSTORE"]
[null,"A","Remove"]
[null,"B","Remove"]
[null,"C","Remove"]
[null,"F","Remove"]